{"text_format":"3","workbook":"xlsx","n_sheets":2,"sheets":["Sheet1","Sheet2"],"not_rendered":{"external_links":1,"defined_names":3},"read":"whole","date_system":"1900"}

{"sheet":"Sheet1","index":0,"n_rows":430,"n_cols":7,"rows_kept":430,"merged":[[1,0,1,6]]}
["附件"]
["锦屏县事业单位2024年公开招聘工作人员资格复审合格\n入闱面试人员名单"]
["姓名","主管部门","单位名称","职位代码","资格复审结果","是否进入面试","备注"]
["刘秋晴","中共锦屏县委宣传部","锦屏县融媒体中心",22610036103,"合格","是"]
["杨云艳","中共锦屏县委宣传部","锦屏县融媒体中心",22610036103,"合格","是"]
["吴树芳","中共锦屏县委宣传部","锦屏县融媒体中心",22610036103,"合格","是"]
["潘波","中国共产党锦屏县直属机关工作委员会","锦屏县直属机关党员服务中心",22610036201,"合格","是"]
["龙千千","中国共产党锦屏县直属机关工作委员会","锦屏县直属机关党员服务中心",22610036201,"合格","是"]
["石德馗","锦屏县水务局","锦屏县水库运行服务中心",22610036301,"合格","是"]
["欧景鹏","锦屏县水务局","锦屏县水库运行服务中心",22610036301,"合格","是"]
["付杰","锦屏县水务局","锦屏县水库运行服务中心",22610036301,"合格","是"]
["刘娟","锦屏县司法局","锦屏县公证处",22610036401,"合格","是"]
["王彩燕","锦屏县司法局","锦屏县公证处",22610036401,"合格","是"]
["李秒","锦屏县司法局","锦屏县公证处",22610036401,"合格","是"]
["杨金林","锦屏县人民政府","锦屏县人工影响天气作业指挥中心",22610036501,"合格","是"]
["王奇","锦屏县人民政府","锦屏县人工影响天气作业指挥中心",22610036501,"合格","是"]
["范燚","锦屏县人民政府","锦屏县人工影响天气作业指挥中心",22610036501,"合格","是"]
["龙东弟","锦屏县工商业联合会","锦屏县工商联经济协作中心",22610036601,"合格","是"]
["曹桧","锦屏县工商业联合会","锦屏县工商联经济协作中心",22610036601,"合格","是"]
["欧阳昌芬","锦屏县工商业联合会","锦屏县工商联经济协作中心",22610036601,"合格","是"]
["刘子峻","锦屏县投资促进局","锦屏县投资促进局",22610036701,"合格","是"]
["屈宏时","锦屏县投资促进局","锦屏县投资促进局",22610036701,"合格","是"]
["吴声凯","锦屏县投资促进局","锦屏县投资促进局",22610036701,"合格","是"]
["吴烺","锦屏县自然资源局","三江镇国土资源所",22610036801,"合格","是"]
["杨凯琼","锦屏县自然资源局","三江镇国土资源所",22610036801,"合格","是"]
["杨永森","锦屏县自然资源局","三江镇国土资源所",22610036801,"合格","是"]
["张双双","锦屏县林业局","锦屏县营林总站",22610036901,"合格","是"]
["杨一帆","锦屏县林业局","锦屏县营林总站",22610036901,"合格","是"]
["马勋娅","锦屏县林业局","锦屏县营林总站",22610036901,"合格","是"]
["刘开英","锦屏县林业局","锦屏县森林资源事务站",22610037001,"合格","是"]
["王昌森","锦屏县林业局","锦屏县森林资源事务站",22610037001,"合格","是"]
["杨定修","锦屏县林业局","锦屏县森林资源事务站",22610037001,"合格","是"]
["王名锋","锦屏县林业局","锦屏县林业种苗与科技推广站",22610037101,"合格","是"]
["王梓良","锦屏县林业局","锦屏县林业种苗与科技推广站",22610037101,"合格","是"]
["付颖","锦屏县林业局","锦屏县林业种苗与科技推广站",22610037101,"合格","是"]
["杨洁","锦屏县林业局","锦屏县国有林场",22610037201,"合格","是"]
["吴仙梅","锦屏县林业局","锦屏县国有林场",22610037201,"合格","是"]
["谢浩男","锦屏县林业局","锦屏县国有林场",22610037201,"合格","是"]
["杨燚","锦屏县河口乡人民政府","锦屏县河口乡乡村振兴工作站",22610037301,"合格","是"]
["范森芝","锦屏县河口乡人民政府","锦屏县河口乡乡村振兴工作站",22610037301,"合格","是"]
["向菊","锦屏县河口乡人民政府","锦屏县河口乡乡村振兴工作站",22610037301,"合格","是"]
["石春愿","锦屏县河口乡人民政府","锦屏县河口乡水利站",22610037401,"合格","是"]
["杨定豪","锦屏县河口乡人民政府","锦屏县河口乡水利站",22610037401,"合格","是"]
["刘琪","锦屏县河口乡人民政府","锦屏县河口乡水利站",22610037401,"合格","是"]
["杨成枝","锦屏县河口乡人民政府","锦屏县河口乡科技宣教文化信息服务中心",22610037501,"合格","是"]
["欧帅帅","锦屏县河口乡人民政府","锦屏县河口乡科技宣教文化信息服务中心",22610037501,"合格","是"]
["杨昕彤","锦屏县河口乡人民政府","锦屏县河口乡科技宣教文化信息服务中心",22610037501,"合格","是"]
["姜涛","锦屏县彦洞乡人民政府","锦屏县彦洞乡财政所",22610037601,"合格","是"]
["张文迪","锦屏县彦洞乡人民政府","锦屏县彦洞乡财政所",22610037601,"合格","是"]
["吴建镖","锦屏县彦洞乡人民政府","锦屏县彦洞乡财政所",22610037601,"合格","是"]
["赵跃","锦屏县平秋镇人民政府","锦屏县平秋镇人力资源和社会保障服务中心",22610037701,"合格","是"]
["龙桃","锦屏县平秋镇人民政府","锦屏县平秋镇人力资源和社会保障服务中心",22610037701,"合格","是"]
["杨铭","锦屏县平秋镇人民政府","锦屏县平秋镇人力资源和社会保障服务中心",22610037701,"合格","是"]
["李中婷","锦屏县敦寨镇人民政府","锦屏县敦寨镇财政所",22610037801,"合格","是"]
["黄黎","锦屏县敦寨镇人民政府","锦屏县敦寨镇财政所",22610037801,"合格","是"]
["龙章怡","锦屏县敦寨镇人民政府","锦屏县敦寨镇财政所",22610037801,"合格","是"]
["张正祥","锦屏县敦寨镇人民政府","锦屏县敦寨镇乡村振兴工作站",22610037901,"合格","是"]
["王延森","锦屏县敦寨镇人民政府","锦屏县敦寨镇乡村振兴工作站",22610037901,"合格","是"]
["彭文梁","锦屏县敦寨镇人民政府","锦屏县敦寨镇乡村振兴工作站",22610037901,"合格","是"]
["龙颖","锦屏县敦寨镇人民政府","锦屏县敦寨镇农业综合服务中心",22610038001,"合格","是"]
["张凯双","锦屏县敦寨镇人民政府","锦屏县敦寨镇农业综合服务中心",22610038001,"合格","是"]
["刘雨","锦屏县敦寨镇人民政府","锦屏县敦寨镇农业综合服务中心",22610038001,"合格","是"]
["杨梅芳","锦屏县敦寨镇人民政府","锦屏县敦寨镇人力资源和社会保障服务中心",22610038101,"合格","是"]
["周品双","锦屏县敦寨镇人民政府","锦屏县敦寨镇人力资源和社会保障服务中心",22610038101,"合格","是"]
["谭春玲","锦屏县敦寨镇人民政府","锦屏县敦寨镇人力资源和社会保障服务中心",22610038101,"合格","是"]
["潘娟","锦屏县新化乡人民政府","锦屏县新化乡农业服务中心",22610038201,"合格","是"]
["杨洪凯","锦屏县新化乡人民政府","锦屏县新化乡农业服务中心",22610038201,"合格","是"]
["吴紫懿","锦屏县新化乡人民政府","锦屏县新化乡农业服务中心",22610038201,"合格","是"]
["吴秋香","锦屏县新化乡人民政府","锦屏县新化乡财政所",22610038301,"合格","是"]
["林艳芳","锦屏县新化乡人民政府","锦屏县新化乡财政所",22610038301,"合格","是"]
["贺承丽","锦屏县新化乡人民政府","锦屏县新化乡财政所",22610038301,"合格","是"]
["杨义广","锦屏县启蒙镇人民政府","锦屏县启蒙镇人力资源和社会保障服务中心",22610038401,"合格","是"]
["杨先玉","锦屏县启蒙镇人民政府","锦屏县启蒙镇人力资源和社会保障服务中心",22610038401,"合格","是"]
["朱以战","锦屏县启蒙镇人民政府","锦屏县启蒙镇人力资源和社会保障服务中心",22610038401,"合格","是"]
["吴楷","锦屏县启蒙镇人民政府","锦屏县启蒙镇人力资源和社会保障服务中心",22610038402,"合格","是"]
["谭元雄","锦屏县启蒙镇人民政府","锦屏县启蒙镇人力资源和社会保障服务中心",22610038402,"合格","是"]
["龙家池","锦屏县启蒙镇人民政府","锦屏县启蒙镇人力资源和社会保障服务中心",22610038402,"合格","是"]
["陆承隆","锦屏县启蒙镇人民政府","锦屏县启蒙镇农业服务中心",22610038501,"合格","是"]
["杨惠清","锦屏县启蒙镇人民政府","锦屏县启蒙镇农业服务中心",22610038501,"合格","是"]
["龙正培","锦屏县启蒙镇人民政府","锦屏县启蒙镇农业服务中心",22610038501,"合格","是"]
["吴豫臻","锦屏县启蒙镇人民政府","锦屏县启蒙镇林业站",22610038601,"合格","是"]
["王瑞长","锦屏县启蒙镇人民政府","锦屏县启蒙镇林业站",22610038601,"合格","是"]
["徐钟宝","锦屏县启蒙镇人民政府","锦屏县启蒙镇林业站",22610038601,"合格","是"]
["罗珍","锦屏县启蒙镇人民政府","锦屏县启蒙镇科技宣教文化信息服务中心",22610038701,"合格","是"]
["龙逢姝","锦屏县启蒙镇人民政府","锦屏县启蒙镇科技宣教文化信息服务中心",22610038701,"合格","是"]
["陆倩倩","锦屏县启蒙镇人民政府","锦屏县启蒙镇科技宣教文化信息服务中心",22610038701,"合格","是"]
["刘莲吉","锦屏县平略镇人民政府","锦屏县平略镇农业服务中心",22610038801,"合格","是"]
["张文才","锦屏县平略镇人民政府","锦屏县平略镇农业服务中心",22610038801,"合格","是"]
["杨光辉","锦屏县平略镇人民政府","锦屏县平略镇林业站",22610038901,"合格","是"]
["彭雁群","锦屏县平略镇人民政府","锦屏县平略镇林业站",22610038901,"合格","是"]
["李茂勇","锦屏县平略镇人民政府","锦屏县平略镇林业站",22610038901,"合格","是"]
["杨永正","锦屏县固本乡人民政府","锦屏县固本乡人力资源和社会保障服务中心",22610039001,"合格","是"]
["龙玉菀","锦屏县固本乡人民政府","锦屏县固本乡人力资源和社会保障服务中心",22610039001,"合格","是"]
["张火梅","锦屏县固本乡人民政府","锦屏县固本乡人力资源和社会保障服务中心",22610039001,"合格","是"]
["潘桂梅","锦屏县固本乡人民政府","锦屏县固本乡人力资源和社会保障服务中心",22610039001,"合格","是"]
["吴竹","锦屏县固本乡人民政府","锦屏县固本乡人力资源和社会保障服务中心",22610039001,"合格","是"]
["胡东萍","锦屏县固本乡人民政府","锦屏县固本乡人力资源和社会保障服务中心",22610039001,"合格","是"]
["刘彬","锦屏县固本乡人民政府","锦屏县固本乡安全生产监督管理站",22610039101,"合格","是"]
["龙建平","锦屏县固本乡人民政府","锦屏县固本乡安全生产监督管理站",22610039101,"合格","是"]
["石禹","锦屏县固本乡人民政府","锦屏县固本乡安全生产监督管理站",22610039101,"合格","是"]
["吴育润","锦屏县大同乡人民政府","锦屏县大同乡人力资源和社会保障服务中心",22610039301,"合格","是"]
["范小源","锦屏县大同乡人民政府","锦屏县大同乡人力资源和社会保障服务中心",22610039301,"合格","是"]
["王家瑶","锦屏县大同乡人民政府","锦屏县大同乡人力资源和社会保障服务中心",22610039301,"合格","是"]
["龙家旺","锦屏县大同乡人民政府","锦屏县大同乡乡村振兴工作站",22610039401,"合格","是"]
["杨巧艳","锦屏县大同乡人民政府","锦屏县大同乡乡村振兴工作站",22610039401,"合格","是"]
["龙亚秋","锦屏县大同乡人民政府","锦屏县大同乡乡村振兴工作站",22610039401,"合格","是"]
["杨正荣","锦屏县大同乡人民政府","锦屏县大同乡林业工作站",22610039501,"合格","是"]
["杨通能","锦屏县大同乡人民政府","锦屏县大同乡林业工作站",22610039501,"合格","是"]
["龚宏","锦屏县大同乡人民政府","锦屏县大同乡林业工作站",22610039501,"合格","是"]
["杨秀灵","锦屏县大同乡人民政府","锦屏县大同乡林业工作站",22610039502,"合格","是"]
["曾可欣","锦屏县大同乡人民政府","锦屏县大同乡林业工作站",22610039502,"合格","是"]
["杨光睿","锦屏县大同乡人民政府","锦屏县大同乡林业工作站",22610039502,"合格","是"]
["杨萍","锦屏县偶里乡人民政府","锦屏县偶里乡人力资源和社会保障服务中心",22610039601,"合格","是"]
["马婷","锦屏县偶里乡人民政府","锦屏县偶里乡人力资源和社会保障服务中心",22610039601,"合格","是"]
["姜国祥","锦屏县偶里乡人民政府","锦屏县偶里乡人力资源和社会保障服务中心",22610039601,"合格","是"]
["杨金金","锦屏县钟灵乡人民政府","锦屏县钟灵乡综治中心",22610039701,"合格","是"]
["龙令芝","锦屏县钟灵乡人民政府","锦屏县钟灵乡综治中心",22610039701,"合格","是"]
["杨靖","锦屏县钟灵乡人民政府","锦屏县钟灵乡综治中心",22610039701,"合格","是"]
["李继录","锦屏县钟灵乡人民政府","锦屏县钟灵乡科技宣教文化信息服务中心（党建工作站）",22610039801,"合格","是"]
["杨娟","锦屏县钟灵乡人民政府","锦屏县钟灵乡科技宣教文化信息服务中心（党建工作站）",22610039801,"合格","是"]
["刘开旺","锦屏县钟灵乡人民政府","锦屏县钟灵乡科技宣教文化信息服务中心（党建工作站）",22610039801,"合格","是"]
["刘泰忠","锦屏县钟灵乡人民政府","锦屏县钟灵乡农业服务中心",22610039901,"合格","是"]
["梁玉清","锦屏县钟灵乡人民政府","锦屏县钟灵乡农业服务中心",22610039901,"合格","是"]
["吴国慧","锦屏县钟灵乡人民政府","锦屏县钟灵乡农业服务中心",22610039901,"合格","是"]
["张洪溶","锦屏县钟灵乡人民政府","锦屏县钟灵乡林业站",22610040001,"合格","是"]
["伍旭丹","锦屏县钟灵乡人民政府","锦屏县钟灵乡林业站",22610040001,"合格","是"]
["杨再云","锦屏县钟灵乡人民政府","锦屏县钟灵乡林业站",22610040001,"合格","是"]
["张沙","锦屏县茅坪镇人民政府","锦屏县茅坪镇乡村振兴工作站",22610040101,"合格","是"]
["徐朝馨","锦屏县茅坪镇人民政府","锦屏县茅坪镇乡村振兴工作站",22610040101,"合格","是"]
["陆承汇","锦屏县茅坪镇人民政府","锦屏县茅坪镇乡村振兴工作站",22610040101,"合格","是"]
["龙明倩","锦屏县茅坪镇人民政府","锦屏县茅坪镇村镇建设服务中心",22610040201,"合格","是"]
["杨天增","锦屏县茅坪镇人民政府","锦屏县茅坪镇村镇建设服务中心",22610040201,"合格","是"]
["龙念源","锦屏县茅坪镇人民政府","锦屏县茅坪镇村镇建设服务中心",22610040201,"合格","是"]
["程国珍","锦屏县茅坪镇人民政府","锦屏县茅坪镇综治中心",22610040301,"合格","是"]
["龙登芳","锦屏县茅坪镇人民政府","锦屏县茅坪镇综治中心",22610040301,"合格","是"]
["李德柳","锦屏县茅坪镇人民政府","锦屏县茅坪镇综治中心",22610040301,"合格","是"]
["田奥静","锦屏县教育和科技局","锦屏县中等职业学校",22610040401,"合格","是"]
["姚丹","锦屏县教育和科技局","锦屏县中等职业学校",22610040401,"合格","是"]
["张培益","锦屏县教育和科技局","锦屏县中等职业学校",22610040401,"合格","是"]
["杨娟","锦屏县教育和科技局","贵州省锦屏县民族中学",22610040501,"合格","是"]
["张优代","锦屏县教育和科技局","贵州省锦屏县民族中学",22610040501,"合格","是"]
["吴运妹","锦屏县教育和科技局","贵州省锦屏县民族中学",22610040501,"合格","是"]
["吴述涛","锦屏县教育和科技局","贵州省锦屏县民族中学",22610040502,"合格","是"]
["潘治凯","锦屏县教育和科技局","贵州省锦屏县民族中学",22610040502,"合格","是"]
["吴梦君","锦屏县教育和科技局","贵州省锦屏县民族中学",22610040504,"合格","是"]
["师明航","锦屏县教育和科技局","贵州省锦屏县民族中学",22610040505,"合格","是"]
["解青松","锦屏县教育和科技局","贵州省锦屏县民族中学",22610040505,"合格","是"]
["杨民","锦屏县教育和科技局","贵州省锦屏县民族中学",22610040505,"合格","是"]
["严晓宇","锦屏县教育和科技局","贵州省锦屏县民族中学",22610040506,"合格","是"]
["胡湘钰","锦屏县教育和科技局","贵州省锦屏县民族中学",22610040506,"合格","是"]
["李佳怡","锦屏县教育和科技局","贵州省锦屏县民族中学",22610040506,"合格","是"]
["杨新平","锦屏县教育和科技局","贵州省锦屏县民族中学",22610040506,"合格","是"]
["周长柳","锦屏县教育和科技局","贵州省锦屏县民族中学",22610040506,"合格","是"]
["岑猛","锦屏县教育和科技局","贵州省锦屏县民族中学",22610040507,"合格","是"]
["陈潇","锦屏县教育和科技局","贵州省锦屏县民族中学",22610040507,"合格","是"]
["田浪","锦屏县教育和科技局","贵州省锦屏县民族中学",22610040507,"合格","是"]
["杨曙华","锦屏县教育和科技局","贵州省锦屏县民族中学",22610040508,"合格","是"]
["谢堂亮","锦屏县教育和科技局","贵州省锦屏县民族中学",22610040508,"合格","是"]
["莫玉芬","锦屏县教育和科技局","贵州省锦屏县民族中学",22610040508,"合格","是"]
["张妙","锦屏县教育和科技局","贵州省锦屏县民族中学",22610040510,"合格","是"]
["谢慧","锦屏县教育和科技局","贵州省锦屏县民族中学",22610040510,"合格","是"]
["雷佳","锦屏县教育和科技局","贵州省锦屏县民族中学",22610040510,"合格","是"]
["吴盈盈","锦屏县教育和科技局","贵州省锦屏县民族中学",22610040511,"合格","是"]
["王桃花","锦屏县教育和科技局","贵州省锦屏县民族中学",22610040511,"合格","是"]
["龙靖","锦屏县教育和科技局","贵州省锦屏县民族中学",22610040511,"合格","是"]
["张秀涛","锦屏县教育和科技局","贵州省锦屏县民族中学",22610040512,"合格","是"]
["蒋宇","锦屏县教育和科技局","贵州省锦屏县民族中学",22610040512,"合格","是"]
["申星","锦屏县教育和科技局","贵州省锦屏县民族中学",22610040513,"合格","是"]
["张彩彩","锦屏县教育和科技局","贵州省锦屏县民族中学",22610040513,"合格","是"]
["尹朋","锦屏县教育和科技局","贵州省锦屏县民族中学",22610040513,"合格","是"]
["彭桃红","锦屏县教育和科技局","贵州省锦屏县民族中学",22610040514,"合格","是"]
["刘荣琳","锦屏县教育和科技局","贵州省锦屏县民族中学",22610040514,"合格","是"]
["许娜","锦屏县教育和科技局","贵州省锦屏县民族中学",22610040514,"合格","是"]
["龙立果","锦屏县教育和科技局","贵州省锦屏县民族中学",22610040514,"合格","是"]
["吴高远","锦屏县教育和科技局","贵州省锦屏县民族中学",22610040514,"合格","是"]
["刘璇","锦屏县教育和科技局","贵州省锦屏县民族中学",22610040514,"合格","是"]
["龙玉灵","锦屏县教育和科技局","贵州省锦屏县民族中学",22610040515,"合格","是"]
["刘艳","锦屏县教育和科技局","贵州省锦屏县民族中学",22610040515,"合格","是"]
["向艳娟","锦屏县教育和科技局","贵州省锦屏县民族中学",22610040515,"合格","是"]
["龙薇","锦屏县教育和科技局","贵州省锦屏县民族中学",22610040516,"合格","是"]
["周美仨","锦屏县教育和科技局","贵州省锦屏县民族中学",22610040516,"合格","是"]
["吴美红","锦屏县教育和科技局","贵州省锦屏县民族中学",22610040516,"合格","是"]
["杨培培","锦屏县教育和科技局","贵州省锦屏县民族中学",22610040517,"合格","是"]
["龙安广","锦屏县教育和科技局","贵州省锦屏县民族中学",22610040517,"合格","是"]
["石梅","锦屏县教育和科技局","贵州省锦屏县民族中学",22610040517,"合格","是"]
["李丹","锦屏县教育和科技局","锦屏县第四中学",22610040601,"合格","是"]
["林安镁","锦屏县教育和科技局","锦屏县第四中学",22610040601,"合格","是"]
["朱光奎","锦屏县教育和科技局","锦屏县第四中学",22610040602,"合格","是"]
["龙金巧","锦屏县教育和科技局","锦屏县第四中学",22610040602,"合格","是"]
["黄琼淑","锦屏县教育和科技局","锦屏县第四中学",22610040603,"合格","是"]
["欧文丽","锦屏县教育和科技局","锦屏县第四中学",22610040603,"合格","是"]
["田茂娟","锦屏县教育和科技局","锦屏县第四中学",22610040604,"合格","是"]
["徐勇","锦屏县教育和科技局","锦屏县第四中学",22610040604,"合格","是"]
["龙令","锦屏县教育和科技局","锦屏县第四中学",22610040604,"合格","是"]
["冯海南","锦屏县教育和科技局","锦屏县第五中学",22610040701,"合格","是"]
["王名钏","锦屏县教育和科技局","锦屏县第五中学",22610040701,"合格","是"]
["何梦丹","锦屏县教育和科技局","锦屏县第五中学",22610040701,"合格","是"]
["林泽青","锦屏县教育和科技局","锦屏县第五中学",22610040703,"合格","是"]
["石宏胜","锦屏县教育和科技局","锦屏县第五中学",22610040703,"合格","是"]
["杨浩","锦屏县教育和科技局","锦屏县第五中学",22610040703,"合格","是"]
["欧罗丹","锦屏县教育和科技局","锦屏县第五中学",22610040704,"合格","是"]
["刘铭","锦屏县教育和科技局","锦屏县第五中学",22610040704,"合格","是"]
["龙雨霜","锦屏县教育和科技局","锦屏县第五中学",22610040704,"合格","是"]
["蔡乐","锦屏县教育和科技局","锦屏县城关一小",22610040801,"合格","是"]
["李元祥","锦屏县教育和科技局","锦屏县城关一小",22610040801,"合格","是"]
["陈郡杰","锦屏县教育和科技局","锦屏县城关一小",22610040801,"合格","是"]
["刘泰梅","锦屏县教育和科技局","锦屏县城关一小",22610040802,"合格","是"]
["龙灵","锦屏县教育和科技局","锦屏县城关一小",22610040802,"合格","是"]
["王燕琴","锦屏县教育和科技局","锦屏县城关一小",22610040802,"合格","是"]
["龙福德","锦屏县教育和科技局","锦屏县城关一小",22610040803,"合格","是"]
["王国奇","锦屏县教育和科技局","锦屏县城关一小",22610040803,"合格","是"]
["邰青","锦屏县教育和科技局","锦屏县城关一小",22610040803,"合格","是"]
["张承豪","锦屏县教育和科技局","锦屏县城关一小",22610040803,"合格","是"]
["王健","锦屏县教育和科技局","锦屏县城关一小",22610040803,"合格","是"]
["曹家碧","锦屏县教育和科技局","锦屏县城关一小",22610040804,"合格","是"]
["杨胜美","锦屏县教育和科技局","锦屏县城关一小",22610040804,"合格","是"]
["杨怡婷","锦屏县教育和科技局","锦屏县城关一小",22610040804,"合格","是"]
["吴如英","锦屏县教育和科技局","锦屏县城关一小",22610040804,"合格","是"]
["杨诗琴","锦屏县教育和科技局","锦屏县城关一小",22610040804,"合格","是"]
["龙送萍","锦屏县教育和科技局","锦屏县城关一小",22610040804,"合格","是"]
["雷明杏","锦屏县教育和科技局","锦屏县城关一小",22610040805,"合格","是"]
["杨灵黎","锦屏县教育和科技局","锦屏县城关一小",22610040805,"合格","是"]
["吴高杰","锦屏县教育和科技局","锦屏县城关一小",22610040805,"合格","是"]
["龙菲菲","锦屏县教育和科技局","锦屏县城关一小",22610040806,"合格","是"]
["田有生","锦屏县教育和科技局","锦屏县城关一小",22610040806,"合格","是"]
["杨艳","锦屏县教育和科技局","锦屏县城关一小",22610040806,"合格","是"]
["徐江涛","锦屏县教育和科技局","锦屏县城关二小",22610040901,"合格","是"]
["李东声","锦屏县教育和科技局","锦屏县城关二小",22610040901,"合格","是"]
["廖珺豪","锦屏县教育和科技局","锦屏县城关二小",22610040901,"合格","是"]
["潘小江","锦屏县教育和科技局","锦屏县城关二小",22610040901,"合格","是"]
["韦再彪","锦屏县教育和科技局","锦屏县城关二小",22610040901,"合格","是"]
["吴位炀","锦屏县教育和科技局","锦屏县城关二小",22610040901,"合格","是"]
["杨美娥","锦屏县教育和科技局","锦屏县城关二小",22610040902,"合格","是"]
["王焱","锦屏县教育和科技局","锦屏县城关二小",22610040902,"合格","是"]
["刘美莲","锦屏县教育和科技局","锦屏县城关二小",22610040902,"合格","是"]
["崔语","锦屏县教育和科技局","锦屏县城关二小",22610040902,"合格","是"]
["潘晓丽","锦屏县教育和科技局","锦屏县城关二小",22610040902,"合格","是"]
["向桂莲","锦屏县教育和科技局","锦屏县城关二小",22610040902,"合格","是"]
["蒋林珍","锦屏县教育和科技局","锦屏县城关二小",22610040904,"合格","是"]
["张超","锦屏县教育和科技局","锦屏县城关二小",22610040905,"合格","是"]
["卢川","锦屏县教育和科技局","锦屏县城关二小",22610040905,"合格","是"]
["李帆","锦屏县教育和科技局","锦屏县城关二小",22610040905,"合格","是"]
["吴敏","锦屏县教育和科技局","锦屏县城关二小",22610040906,"合格","是"]
["龙盼盼","锦屏县教育和科技局","锦屏县城关二小",22610040906,"合格","是"]
["龙芳满","锦屏县教育和科技局","锦屏县城关二小",22610040906,"合格","是"]
["范杨琴","锦屏县教育和科技局","锦屏县城关二小",22610040907,"合格","是"]
["梁焕","锦屏县教育和科技局","锦屏县城关二小",22610040907,"合格","是"]
["欧阳慧慧","锦屏县教育和科技局","锦屏县城关二小",22610040907,"合格","是"]
["龙柳红","锦屏县教育和科技局","锦屏县城关三小",22610041001,"合格","是"]
["杨琪","锦屏县教育和科技局","锦屏县城关三小",22610041001,"合格","是"]
["张凤","锦屏县教育和科技局","锦屏县城关三小",22610041001,"合格","是"]
["粟渝翔","锦屏县教育和科技局","锦屏县城关三小",22610041002,"合格","是"]
["罗康秋","锦屏县教育和科技局","锦屏县城关三小",22610041002,"合格","是"]
["杨芬","锦屏县教育和科技局","锦屏县城关三小",22610041003,"合格","是"]
["吴诏林","锦屏县教育和科技局","锦屏县城关三小",22610041003,"合格","是"]
["袁兰春","锦屏县教育和科技局","锦屏县城关三小",22610041003,"合格","是"]
["李启胜","锦屏县教育和科技局","锦屏县城关三小",22610041004,"合格","是"]
["罗超","锦屏县教育和科技局","锦屏县城关三小",22610041004,"合格","是"]
["王伟","锦屏县教育和科技局","锦屏县城关三小",22610041004,"合格","是"]
["杨娟","锦屏县教育和科技局","锦屏县城关三小",22610041005,"合格","是"]
["杨梅","锦屏县教育和科技局","锦屏县城关三小",22610041005,"合格","是"]
["覃娜娜","锦屏县教育和科技局","锦屏县城关三小",22610041005,"合格","是"]
["赵星鹏","锦屏县教育和科技局","锦屏县城关四小",22610041101,"合格","是"]
["杨斌","锦屏县教育和科技局","锦屏县城关四小",22610041101,"合格","是"]
["刘辉","锦屏县教育和科技局","锦屏县城关四小",22610041101,"合格","是"]
["李治良","锦屏县教育和科技局","锦屏县城关四小",22610041101,"合格","是"]
["赵宇","锦屏县教育和科技局","锦屏县城关四小",22610041101,"合格","是"]
["陶政雅","锦屏县教育和科技局","锦屏县城关四小",22610041101,"合格","是"]
["姜运美","锦屏县教育和科技局","锦屏县城关四小",22610041101,"合格","是"]
["申君杰","锦屏县教育和科技局","锦屏县城关四小",22610041101,"合格","是"]
["邰丁丁","锦屏县教育和科技局","锦屏县城关四小",22610041101,"合格","是"]
["黄岭","锦屏县教育和科技局","锦屏县城关四小",22610041101,"合格","是"]
["龙红榕","锦屏县教育和科技局","锦屏县城关四小",22610041102,"合格","是"]
["龙果","锦屏县教育和科技局","锦屏县城关四小",22610041102,"合格","是"]
["杨香艳","锦屏县教育和科技局","锦屏县城关四小",22610041102,"合格","是"]
["李焰","锦屏县教育和科技局","锦屏县城关四小",22610041102,"合格","是"]
["胡露沙","锦屏县教育和科技局","锦屏县城关四小",22610041102,"合格","是"]
["欧正艳","锦屏县教育和科技局","锦屏县城关四小",22610041102,"合格","是"]
["王小芳","锦屏县教育和科技局","锦屏县城关四小",22610041102,"合格","是"]
["吴志娟","锦屏县教育和科技局","锦屏县城关四小",22610041102,"合格","是"]
["范贤煜","锦屏县教育和科技局","锦屏县城关四小",22610041102,"合格","是"]
["彭磊","锦屏县教育和科技局","锦屏县城关四小",22610041103,"合格","是"]
["杨兴海","锦屏县教育和科技局","锦屏县城关四小",22610041103,"合格","是"]
["高浪","锦屏县教育和科技局","锦屏县城关四小",22610041103,"合格","是"]
["江锡峰","锦屏县教育和科技局","锦屏县城关四小",22610041103,"合格","是"]
["向开林","锦屏县教育和科技局","锦屏县城关四小",22610041103,"合格","是"]
["杨昌伟","锦屏县教育和科技局","锦屏县城关四小",22610041103,"合格","是"]
["申娅婷","锦屏县教育和科技局","锦屏县城关四小",22610041104,"合格","是"]
["刘琴","锦屏县教育和科技局","锦屏县城关四小",22610041104,"合格","是"]
["姜俊琪","锦屏县教育和科技局","锦屏县城关四小",22610041104,"合格","是"]
["梁爱林","锦屏县教育和科技局","锦屏县城关四小",22610041104,"合格","是"]
["刘柏林","锦屏县教育和科技局","锦屏县城关四小",22610041105,"合格","是"]
["龙开菊","锦屏县教育和科技局","锦屏县城关四小",22610041105,"合格","是"]
["肖嘉慧","锦屏县教育和科技局","锦屏县城关四小",22610041105,"合格","是"]
["杨欣","锦屏县教育和科技局","锦屏县城关四小",22610041106,"合格","是"]
["冉佳薇","锦屏县教育和科技局","锦屏县城关四小",22610041106,"合格","是"]
["欧阳章菊","锦屏县教育和科技局","锦屏县城关四小",22610041106,"合格","是"]
["王泽钊","锦屏县教育和科技局","锦屏县城关四小",22610041107,"合格","是"]
["秦胜祖","锦屏县教育和科技局","锦屏县城关四小",22610041107,"合格","是"]
["韩仪","锦屏县教育和科技局","锦屏县城关四小",22610041107,"合格","是"]
["陈英庆","锦屏县教育和科技局","锦屏县城关四小",22610041108,"合格","是"]
["张琼","锦屏县教育和科技局","锦屏县城关四小",22610041108,"合格","是"]
["杨韵涵","锦屏县教育和科技局","锦屏县城关四小",22610041108,"合格","是"]
["王圆圆","锦屏县教育和科技局","锦屏县城关五小",22610041201,"合格","是"]
["龙媛玲","锦屏县教育和科技局","锦屏县城关五小",22610041201,"合格","是"]
["龙代琴","锦屏县教育和科技局","锦屏县城关五小",22610041201,"合格","是"]
["张力月","锦屏县教育和科技局","锦屏县城关五小",22610041202,"合格","是"]
["杨媛","锦屏县教育和科技局","锦屏县城关五小",22610041202,"合格","是"]
["王炉娟","锦屏县教育和科技局","锦屏县城关五小",22610041202,"合格","是"]
["潘胜优","锦屏县教育和科技局","锦屏县特殊教育学校",22610041301,"合格","是"]
["李然","锦屏县教育和科技局","锦屏县特殊教育学校",22610041301,"合格","是"]
["杨瑞林","锦屏县教育和科技局","锦屏县特殊教育学校",22610041301,"合格","是"]
["谢宁","锦屏县教育和科技局","锦屏县特殊教育学校",22610041302,"合格","是"]
["龙翠芝","锦屏县教育和科技局","锦屏县特殊教育学校",22610041302,"合格","是"]
["杨娟","锦屏县教育和科技局","锦屏县特殊教育学校",22610041302,"合格","是"]
["李茂霞","锦屏县教育和科技局","锦屏县特殊教育学校",22610041302,"合格","是"]
["龙召丽","锦屏县教育和科技局","锦屏县示范幼儿园",22610041401,"合格","是"]
["龙金红","锦屏县教育和科技局","锦屏县示范幼儿园",22610041401,"合格","是"]
["龙东秀","锦屏县教育和科技局","锦屏县示范幼儿园",22610041401,"合格","是"]
["刘丽","锦屏县教育和科技局","锦屏县示范幼儿园",22610041401,"合格","是"]
["龙梅","锦屏县教育和科技局","锦屏县城关第一幼儿园",22610041501,"合格","是"]
["龙雨","锦屏县教育和科技局","锦屏县城关第一幼儿园",22610041501,"合格","是"]
["龙湄","锦屏县教育和科技局","锦屏县城关第一幼儿园",22610041501,"合格","是"]
["赵平","锦屏县教育和科技局","锦屏县敦寨小学",22610041601,"合格","是"]
["杨海燕","锦屏县教育和科技局","锦屏县敦寨小学",22610041602,"合格","是"]
["曾德祥","锦屏县教育和科技局","锦屏县敦寨小学",22610041602,"合格","是"]
["龙田竹","锦屏县教育和科技局","锦屏县敦寨小学",22610041602,"合格","是"]
["杨柳秋","锦屏县教育和科技局","锦屏县敦寨小学",22610041603,"合格","是"]
["吴庆益","锦屏县教育和科技局","锦屏县敦寨小学",22610041603,"合格","是"]
["陈芳","锦屏县教育和科技局","锦屏县敦寨小学",22610041603,"合格","是"]
["王明霞","锦屏县教育和科技局","锦屏县敦寨小学",22610041604,"合格","是"]
["刘玉凤","锦屏县教育和科技局","锦屏县敦寨小学",22610041604,"合格","是"]
["张福洋","锦屏县教育和科技局","锦屏县敦寨小学",22610041604,"合格","是"]
["赵帅","锦屏县教育和科技局","锦屏县敦寨小学",22610041605,"合格","是"]
["杨晨","锦屏县教育和科技局","锦屏县敦寨小学",22610041605,"合格","是"]
["李海艳","锦屏县教育和科技局","锦屏县敦寨小学",22610041606,"合格","是"]
["罗汇","锦屏县教育和科技局","锦屏县敦寨小学",22610041606,"合格","是"]
["李霞","锦屏县教育和科技局","锦屏县敦寨小学",22610041606,"合格","是"]
["杨柳","锦屏县教育和科技局","锦屏县敦寨小学",22610041607,"合格","是"]
["杨莹","锦屏县教育和科技局","锦屏县敦寨小学",22610041607,"合格","是"]
["张小鲒","锦屏县教育和科技局","锦屏县敦寨小学",22610041607,"合格","是"]
["肖曲","锦屏县教育和科技局","锦屏县敦寨中学",22610041701,"合格","是"]
["吴隆香","锦屏县教育和科技局","锦屏县敦寨中学",22610041701,"合格","是"]
["潘婷婷","锦屏县教育和科技局","锦屏县敦寨中学",22610041701,"合格","是"]
["杨菊","锦屏县教育和科技局","锦屏县敦寨中学",22610041701,"合格","是"]
["黄胤","锦屏县教育和科技局","锦屏县敦寨中学",22610041702,"合格","是"]
["佘乾文","锦屏县教育和科技局","锦屏县敦寨中学",22610041702,"合格","是"]
["杨燕","锦屏县教育和科技局","锦屏县敦寨中学",22610041703,"合格","是"]
["潘玲芳","锦屏县教育和科技局","锦屏县敦寨中学",22610041703,"合格","是"]
["龙坤兰","锦屏县教育和科技局","锦屏县敦寨中学",22610041703,"合格","是"]
["李世新","锦屏县教育和科技局","锦屏县敦寨中学",22610041704,"合格","是"]
["黄锡跃","锦屏县教育和科技局","锦屏县敦寨中学",22610041704,"合格","是"]
["陆天","锦屏县教育和科技局","锦屏县敦寨中学",22610041704,"合格","是"]
["邓娅","锦屏县教育和科技局","锦屏县敦寨中学",22610041705,"合格","是"]
["欧阳效森","锦屏县教育和科技局","锦屏县敦寨中学",22610041706,"合格","是"]
["彭图德","锦屏县教育和科技局","锦屏县敦寨中学",22610041706,"合格","是"]
["雷小慧","锦屏县教育和科技局","锦屏县敦寨中学",22610041707,"合格","是"]
["胡丽红","锦屏县教育和科技局","锦屏县敦寨中学",22610041707,"合格","是"]
["王婷","锦屏县教育和科技局","锦屏县敦寨中学",22610041708,"合格","是"]
["吴高竹","锦屏县教育和科技局","锦屏县敦寨中学",22610041710,"合格","是"]
["王莎莎","锦屏县教育和科技局","锦屏县敦寨中学",22610041710,"合格","是"]
["吴姜彦","锦屏县教育和科技局","锦屏县敦寨中学",22610041710,"合格","是"]
["杨婷","锦屏县教育和科技局","锦屏县敦寨中学",22610041711,"合格","是"]
["刘倩","锦屏县教育和科技局","锦屏县敦寨中学",22610041711,"合格","是"]
["陆世黎","锦屏县教育和科技局","锦屏县敦寨中学",22610041711,"合格","是"]
["唐永常","锦屏县教育和科技局","锦屏县新化小学",22610041801,"合格","是"]
["张宽芳","锦屏县教育和科技局","锦屏县新化小学",22610041802,"合格","是"]
["杨艳","锦屏县教育和科技局","锦屏县新化小学",22610041802,"合格","是"]
["刘秀桃","锦屏县教育和科技局","锦屏县新化小学",22610041802,"合格","是"]
["黄盖","锦屏县教育和科技局","锦屏县钟灵小学",22610041901,"合格","是"]
["王艳松","锦屏县教育和科技局","锦屏县钟灵小学",22610041902,"合格","是"]
["杨祖满","锦屏县教育和科技局","锦屏县钟灵小学",22610041902,"合格","是"]
["龙本喜","锦屏县教育和科技局","锦屏县文斗小学",22610042001,"合格","是"]
["杨义江","锦屏县教育和科技局","锦屏县文斗小学",22610042001,"合格","是"]
["肖飞","锦屏县教育和科技局","锦屏县文斗小学",22610042001,"合格","是"]
["杨妮","锦屏县教育和科技局","锦屏县文斗小学",22610042002,"合格","是"]
["朱子香","锦屏县教育和科技局","锦屏县文斗小学",22610042002,"合格","是"]
["彭凌芬","锦屏县教育和科技局","锦屏县文斗小学",22610042002,"合格","是"]
["田晶晶","锦屏县教育和科技局","锦屏县裕和小学",22610042101,"合格","是"]
["吴夜零","锦屏县教育和科技局","锦屏县裕和小学",22610042101,"合格","是"]
["吕小风","锦屏县教育和科技局","锦屏县裕和小学",22610042101,"合格","是"]
["邹兰兰","锦屏县教育和科技局","锦屏县新民小学",22610042201,"合格","是"]
["王江花","锦屏县教育和科技局","锦屏县新民小学",22610042201,"合格","是"]
["刘凤云","锦屏县教育和科技局","锦屏县新民小学",22610042201,"合格","是"]
["蒲帧臻","锦屏县公安局","锦屏县公安局监管场所卫生所",22610042301,"合格","是"]
["杨世金","锦屏县公安局","锦屏县公安局监管场所卫生所",22610042301,"合格","是"]
["吴言龙","锦屏县公安局","锦屏县公安局监管场所卫生所",22610042301,"合格","是"]
["龙尧","锦屏县公安局","锦屏县公安局监管场所卫生所",22610042302,"合格","是"]
["白兴瑶","锦屏县公安局","锦屏县公安局监管场所卫生所",22610042302,"合格","是"]
["王鑫荣","锦屏县公安局","锦屏县公安局监管场所卫生所",22610042302,"合格","是"]
["王天云","锦屏县卫生健康局","锦屏县固本乡卫生院",22610042401,"合格","是"]
["黄焜","锦屏县卫生健康局","锦屏县固本乡卫生院",22610042401,"合格","是"]
["杨菁菁","锦屏县卫生健康局","锦屏县固本乡卫生院",22610042401,"合格","是"]
["鲍先娜","锦屏县卫生健康局","锦屏县固本乡卫生院",22610042402,"合格","是"]
["吴声炳","锦屏县卫生健康局","锦屏县固本乡卫生院",22610042402,"合格","是"]
["吴圣","锦屏县卫生健康局","锦屏县固本乡卫生院",22610042402,"合格","是"]
["林安囡","锦屏县卫生健康局","锦屏县偶里乡卫生院",22610042501,"合格","是"]
["王扬水","锦屏县卫生健康局","锦屏县偶里乡卫生院",22610042501,"合格","是"]
["陈文香","锦屏县卫生健康局","锦屏县偶里乡卫生院",22610042502,"合格","是"]
["曹路梅","锦屏县卫生健康局","锦屏县偶里乡卫生院",22610042502,"合格","是"]
{"$rows_left_out":31}
{"sheet":"Sheet2","index":1,"n_rows":51,"n_cols":4,"rows_kept":51}
["秦兴叶",null,"18748643507","18748643507"]
["吴梦君",null,"15107477074","13574364230"]
["张妙",null,"17385601121","15185838683"]
["谢慧",null,"18890767872","13532776596"]
["雷佳",null,"19885314156","15085663070"]
["张秀涛",null,"18386629465","18386629465"]
["蒋宇",null,"18690760752","15286435896"]
["朱光奎",null,"1501231150","15752445076"]
["龙金巧",null,"18485597159","18212291056"]
["龙福德",null,"15721720220","17885299465"]
["王国奇",null,"15185617276","13985289446"]
["邰青",null,"18385758234","18212376674"]
["张承豪",null,"15772540981","13885584985"]
["王健",null,"18585526349","17388558493"]
["蒋林珍",null,"15285261875","19185191405"]
["粟渝翔",null,"18932190615","18975079555"]
["罗康秋",null,"18285598034","16675529027"]
["申娅婷",null,"18212426648","18212426648"]
["刘琴",null,"15985544626","18285534489"]
["姜俊琪",null,"18744810237","18212255764"]
["梁爱林",null,"17872950833","17872950833"]
["刘月桂",null,"18788716144","15286644238"]
["赵平",null,"18287352670","18285541474"]
["李世新",null,"19985561591","13078586090"]
["黄锡跃",null,"15885831410","15585328853"]
["陆天",null,"19048356646","18788712404"]
["陈佳垚",null,"15200696156","18585121271"]
["邓娅",null,"18786231484","19985092098"]
["雷小慧",null,"19311993074","19311993074"]
["胡丽红",null,"18286597320","18286597320"]
["王婷",null,"15284697876","18224984546"]
["刘松湲",null,"18212737213","18485812235"]
["唐永常",null,"18385772607","13158378396"]
["黄盖",null,"17585552384","19117740289"]
["王艳松",null,"18285524884","19885375540"]
["杨祖满",null,"18722847564","18385710672"]
["林安囡",null,"15085663766","15185657338"]
["王扬水",null,"18385695764","13159220203"]
["龙鸿翰",null,"13310451612","18085849112"]
["杨堉梅",null,"15608503750","18076214132"]
["龙庆铵",null,"15185740355","15085267035"]
["杨清权",null,"18085563854","18285102018"]
["杨昌贵",null,"15286289558","18885415912"]
["李钊",null,"15085204927","15085204927"]
["邓泽琼",null,"18286568037","15985524086"]
["杨晓",null,"15870242632","15085679286"]
["石金辉",null,"18300911501","18208641197"]
[null,null,{"$f":"VLOOKUP(A48,[1]sheet1!$D$2:$E$3221,2,0)","v":{"$error":"#N/A"}}]
[null,null,{"$f":"VLOOKUP(A49,[1]sheet1!$D$2:$E$3221,2,0)","v":{"$error":"#N/A"}}]
[null,null,{"$f":"VLOOKUP(A50,[1]sheet1!$D$2:$E$3221,2,0)","v":{"$error":"#N/A"}}]
[null,null,{"$f":"VLOOKUP(A51,[1]sheet1!$D$2:$E$3221,2,0)","v":{"$error":"#N/A"}}]